s12

joined 2 years ago
 
[–] [email protected] 1 points 1 week ago (1 children)

Apparently Reform has been imploding lately.

[–] [email protected] 9 points 1 week ago

A moonlit hike with something comfortable for the cold?

[–] [email protected] 10 points 1 week ago

Vet: “Soo… what do you want me to do?”
Mother: “Just put him down.”
Vet: *Puts him on the floor.
Mother: “Thanks!”
Mother: *Leaves with her child.

[–] [email protected] 1 points 1 week ago (2 children)
[–] [email protected] 13 points 2 weeks ago (1 children)

Not if you encrypt the zip.

[–] [email protected] 3 points 2 weeks ago (4 children)

Then club together to raise awareness, take legal action, shame them in the press, set up you own alternatives.

Pretty sure that everyone over in the US has already tried and failed this. If not, then you’re 100% correct.

[–] [email protected] 3 points 2 weeks ago (20 children)

It’s definitely sad and unfortunate that someone had to die, but I heard they were using unethical means to exploit vulnerable people and cause the deaths of many others.

If the police weren’t going to do anything about the CEO, then sadly, it’s ultimately necessary for a vigilante to step up.

It’s why you need a fair legal system.

[–] [email protected] 3 points 3 weeks ago

Looks stale.

[–] [email protected] 1 points 3 weeks ago

Yes. I held off mining too much until I got one.

 
[–] [email protected] 3 points 1 month ago

Nyaa? Nyaaa…
Nya.

Nya Nyaa. Nya Nya Nyaa Nya Nyaa Nyaa.

Nyaa.

 

The UK's Stop Killing Games petition is finally back up!

Link to petition: https://petition.parliament.uk/petitions/702074/
Link to campaign: stopkillinggames.com
Link to the campaigner’s initial video

The previous one was closed due to the general election, and it never got the revised response that was requested.
Previous petition.
Previous thread for it.

Update: Link to the campaigner’s video on the response

 

cross-posted from: https://sopuli.xyz/post/18489384

After I started up my computer, having updated the last time I used it, going past the log in screen just shows the desktop background for a little bit, before a black screen with just a cursor. The Lock Screen still works if I shut the laptop lid or leave the computer enough, but the screen doesn’t seem to turn off properly when shutting the lid and most keyboard shortcuts don’t work, though I can still go to tty.

I tried updating. I tried reinstalling Cinnamon. That didn’t work, but installed lxde and selecting that at login worked, but Cinnamon still doesn’t.

I eventually found out that right clicking the black screen Cinnamon desktop still works, and I can get windows such as the terminal like that, but the windows won’t move or resize.

Probably just going to do a new install.

 

After I started up my computer, having updated the last time I used it, going past the log in screen just shows the lock-screen background for a little bit, before a black screen with just a cursor. The Lock Screen still works if I shut the laptop lid or leave the computer enough, but the screen doesn’t seem to turn off properly when shutting the lid and most keyboard shortcuts don’t work, though I can still go to tty.

I tried updating. I tried reinstalling Cinnamon. That didn’t work, but installing lxde and selecting that at login worked, but Cinnamon still doesn’t.

I eventually found out that right clicking the black screen Cinnamon desktop still works, and I can get windows such as the terminal like that, but the windows won’t move or resize.

Probably just going to do a new install.

 

How can av1_amf be used with ffmpeg as stated on the ffmpeg wiki?

I have already tried asking on the ffmpeg user mailing list, but I haven't got a response.

 

Will I need to clean out dust. How would I do this? How often would I need to do this? Are there any good tutorials on how this would be done?

 

I've been using Linux for at least 2 years. I have Linux Mint on my main computer and Debian on my old computer. Trying to apt update says that the connection failed to security.ubuntu.com, deb.debian.org, ftp.uk.debian.org, etc.

Updating directly from sources such as for the Brave Browser still works. Sites not necessary for updating still work. Accessing them through browser doesn't work (It would give a "Connection was reset" error (for Debian) or an error that mentioned DNS (for main computer)). Pinging them seemed to work. Accessing these sites on my phone still works (though it didn't until I accessed them through mobile data and switched back to wifi). Connecting my Linux Mint computer through mobile data to apt update and switching it back to wifi resolved the issue for my Linux Mint computer, but I wasn't able to get my Debian system to connect through my phone.

Any ideas for causes/resolutions?

 

I have a repository that contains multiple programs:

.
└── Programs
    ├── program1
    │   └── Generic_named.py
    └── program2
        └── Generic_named.py

I would like to add testing to this repository.

I have attempted to do it like this:

.
├── Programs
│   ├── program1
│   │   └── Generic_named.py
│   └── program2
│       └── Generic_named.py
└── Tests
    ├── mock
    │   ├── 1
    │   │   └── custom_module.py
    │   └── 2
    │       └── custom_module.py
    ├── temp
    ├── test1.py
    └── test2.py

Where temp is a folder to store each program temporarily with mock versions of any required imports that can not be stored directly with the program.

Suppose we use a hello world example like this:

cat Programs/program1/Generic_named.py
import custom_module

def main():
    return custom_module.out()


cat Programs/program2/Generic_named.py
import custom_module

def main():
    return custom_module.out("Goodbye, World!")


cat Tests/mock/1/custom_module.py
def out():return "Hello, World!"


cat Tests/mock/2/custom_module.py
def out(x):return x

And I were to use these scripts to test it:

cat Tests/test1.py
import unittest
import os
import sys
import shutil

if os.path.exists('Tests/temp/1'):
    shutil.rmtree('Tests/temp/1')

shutil.copytree('Tests/mock/1', 'Tests/temp/1/')
shutil.copyfile('Programs/program1/Generic_named.py', 'Tests/temp/1/Generic_named.py')

sys.path.append('Tests/temp/1')
import Generic_named
sys.path.remove('Tests/temp/1')

class Test(unittest.TestCase):
    def test_case1(self):
            self.assertEqual(Generic_named.main(), "Hello, World!")

if __name__ == '__main__':
    unittest.main()



cat Tests/test2.py
import unittest
import os
import sys
import shutil

if os.path.exists('Tests/temp/2'):
    shutil.rmtree('Tests/temp/2')

shutil.copytree('Tests/mock/2', 'Tests/temp/2')
shutil.copyfile('Programs/program2/Generic_named.py', 'Tests/temp/2/Generic_named.py')

sys.path.append('Tests/temp/2')
import Generic_named
sys.path.remove('Tests/temp/2')

class Test(unittest.TestCase):
    def test_case1(self):
            self.assertEqual(Generic_named.main(), "Goodbye, World!")

if __name__ == '__main__':
    unittest.main()

Both tests pass when run individually:

python3 -m unittest Tests/test1.py
.
----------------------------------------------------------------------
Ran 1 test in 0.000s

OK


python3 -m unittest Tests/test2.py
.
----------------------------------------------------------------------
Ran 1 test in 0.000s

OK

However, they fail when being run together:

python3 -m unittest discover -p test*.py -s Tests/
.F
======================================================================
FAIL: test_case1 (test2.Test)
----------------------------------------------------------------------
Traceback (most recent call last):
  File "/home/s/Documents/Coding practice/2024/Test Mess/1/Tests/test2.py", line 18, in test_case1
    self.assertEqual(Generic_named.main(), "Goodbye, World!")
AssertionError: 'Hello, World!' != 'Goodbye, World!'
- Hello, World!
+ Goodbye, World!


----------------------------------------------------------------------
Ran 2 tests in 0.001s

FAILED (failures=1)

If I try to use a different temporary name for one of the scripts I am trying to test,

cat Tests/test2.py
import unittest
import os
import sys
import shutil

if os.path.exists('Tests/temp/2'):
    shutil.rmtree('Tests/temp/2')

shutil.copytree('Tests/mock/2', 'Tests/temp/2')
shutil.copyfile('Programs/program2/Generic_named.py', 'Tests/temp/2/Generic_named1.py')

sys.path.append('Tests/temp/2')
import Generic_named1
sys.path.remove('Tests/temp/2')

class Test(unittest.TestCase):
    def test_case1(self):
            self.assertEqual(Generic_named1.main(), "Goodbye, World!")

if __name__ == '__main__':
    unittest.main()

Then I get a different error:

python3 -m unittest discover -p test*.py -s Tests/
.E
======================================================================
ERROR: test_case1 (test2.Test)
----------------------------------------------------------------------
Traceback (most recent call last):
  File "/home/s/Documents/Coding practice/2024/Test Mess/2/Tests/test2.py", line 18, in test_case1
    self.assertEqual(Generic_named1.main(), "Goodbye, World!")
  File "/home/s/Documents/Coding practice/2024/Test Mess/2/Tests/temp/2/Generic_named1.py", line 4, in main
    return custom_module.out("Goodbye, World!")
TypeError: out() takes 0 positional arguments but 1 was given

----------------------------------------------------------------------
Ran 2 tests in 0.001s

FAILED (errors=1)

It seems to be trying to import the same file, despite me using a different file from a different path with the same name. This seems strange, as I've been making sure to undo any changes to the Python Path after importing what I wish to test. Is there any way to mock the path? I can't change the name of the custom_module, as that would require changing the programs I wish to test.

How should I write, approach, or setup these tests such that they can be tested with unittest discover the same as they can individually?

 

Even without the search, those two were the only small SSDs I could find under "Memory and Storage".

 

I assembled my new Framework laptop 16 yesterday and tested it out with a live Linux Mint environment.

Today I tried to install Linux Mint to a storage expansion card. During the instillation, I had to create a secure boot password for the codecs. When partitioning, I made a 32GB Swap and had the rest of the storage as root. During the instillation, there was a fatal error. I tried unmounting the partitions on the card to create a new table to try again (using fdisk). This also gave an error, so I decided to reboot.

When rebooting, the error shown in the image was displayed and then the computer is powered off. Trying to turn it on without the live USB inserted goes to bios. I tried re imaging the USB, but the Framework still displays the same error. I tried disabling secure boot; same result. I tried factory resetting secure boot; same result. I tried booting without the expansion card; same result.

Transcription:

Failed to open \EFI\BOOT\mmx64.efi - Not Found
Failed to load image ###: Not Found
Failed to start MokManager: Not Found
Something has gone seriously wrong: Import_mok_state() failed: Not Found

The "#"s are completely solid (or possibly checked) characters.

I tried creating a debian USB, but using that gave the same error.

I'm unsure what I should do. Any help would be great. Thank you in advance!

Solution: Go into the BIOS with the USB inserted and locate the boot from file option, then navigate the usb to find the grub efi file and use it to boot.

 
view more: next ›